فضای پیرافشرده
scope note: فضای هاسدورفی که هر پوشش باز آن یک تظریف موضعا متناهی داشته باشد.
broader: فضای فشرده
preferred label: paracompact space @en
type: Concept

فضای فشرده
preferred label: compact space @en
type: Concept
narrower: فضای پیرافشرده