مجموعه تحلیلی
scope note: زیر مجموعه ای از یک فضای متریک کامل تفکیک پذیر که نگاره پیوسته ای از یک مجموعه بورل در آن فضای متریک است.
related: فضای تحلیلی
broader: فضای متری کامل
preferred label: analytic set @en
type: Concept

فضای تحلیلی
preferred label: analytic space @en
type: Concept
related: مجموعه تحلیلی

فضای متری کامل
preferred label: complete metric space @en
type: Concept
narrower: مجموعه تحلیلی