فضای متری
preferred label: metric space @en
type: Concept
narrower: متر

متر
scope note: یک تابع "فاصله"حقیقی مقدار روی فضایی توپولوژیک، که در 4 اصل صدق میکند.
related: فضای برداری توپولوژیک نرم‌پذیر
broader: فضای متری
preferred label: metric @en
type: Concept

فضای برداری توپولوژیک نرم‌پذیر
preferred label: normable topological vector space @en
type: Concept
related: متر