فضای متریک‌پذیر
preferred label: metrizable space @en
type: Concept
related: قضیه اوریسون

فضای منظم
preferred label: regular space @en
type: Concept
narrower: قضیه اوریسون

قضیه اوریسون
scope note: یک فضای منظم که توپولوژی آن پایه شمارایی دارد، متریک پذیر است.
related: فضای متریک‌پذیر
broader: فضای منظم
preferred label: Urysohn theorem @en
type: Concept