توپولوژی عمومی
preferred label: general topology @en
type: Concept
narrower: مسئله بستار کوراتوفسکی

مسئله بستار کوراتوفسکی
scope note: نشان دادن اینکه حداکثر چهارده مجموعه متمایز را می توان با اعمال مکرر عمل های بستار و متمم گیری از زیر مجموعه ای از فضای توپولوژیک بدست آورد.
broader: توپولوژی عمومی
preferred label: Kuratowski closure problem @en
type: Concept