تابع مبین
scope note: ترکیبی خطی از متغیرها که پیشامدها را که متغیرها به ازای آنها اندازه‌گیری می‌شوند، طوری رده‌بندی می‌کند که نسبت خطا در رده بندی کوچکترین نسبت ممکن است.
broader: آمار چندمتغیری
preferred label: discriminant function @en
type: Concept

آمار چندمتغیری
preferred label: multivariate statistics @en
type: Concept
narrower: تابع مبین