انحراف میانگین مطلق
scope note: انحراف میانگین مطلق، میانگین حسابی قدر مطلق انحرافات یک متغیر از مقدار مورد انتظارش می باشد.
related: شیمی تجزیه
broader: انحراف متوسط
preferred label: absolute mean deviation @en
type: Concept

شیمی تجزیه
preferred label: analytical chemistry @en
type: Concept
related: انحراف میانگین مطلق

انحراف متوسط
preferred label: average deviation @en
type: Concept
narrower: انحراف میانگین مطلق