دهک
scope note: هر یک از نقاطی که کل تعداد داده ها در یک توزیع فراوانی را به 10 قسمت برابر تقسیم می کنند.
broader: چندک
preferred label: decile @en
type: Concept

چندک
preferred label: quantile @en
type: Concept
narrower: دهک