تابع متعالی
alternative label: تابع غیر جبری
scope note: تابعی که نمی توان آن را به وسیله عبارتی جبری که فقط شامل متغیر ها و ثابت ها باشد مشخص کرد.
related: تابع لگاریتم
broader: تابع
preferred label: transcendental function @en
type: Concept

تابع لگاریتم
preferred label: logarithm function @en
type: Concept
related: تابع متعالی

تابع
preferred label: function @en
type: Concept
narrower: تابع متعالی