مینیمم
preferred label: minimum @en
type: Concept
narrower: مینیمم نسبی

مینیمم نسبی
alternative label: حداقل نسبی
scope note: مقداری از یک تابع در نقطه ای چون a که نابیشتر از مقادیر تابع در همه نقاط واقع در یک همسایگی a است
broader: مینیمم
preferred label: relative minimum @en
type: Concept