ناپیوستگی
preferred label: discontinuity @en
type: Concept
narrower: ناپیوستگی رفع‌شدنی

ناپیوستگی رفع‌شدنی
alternative label: انفصال رفع شدنی
scope note: نقطه ای که تابع در آن ناپیوسته است ولی می توان تابع را چنان در آن نقطه دوباره تعریف کرد که در آنجا پیوسته باشد.
broader: ناپیوستگی
preferred label: removable discontinuity @en
type: Concept