تحلیل رگرسیون
preferred label: regression analysis @en
type: Concept
narrower: تحلیل بافه‌ای

تحلیل بافه‌ای
scope note: روشی نموداری در تحلیل همشار که همه زیرمجموعه های ضریبهای رگرسیونی در یک مجموعۀ کامل با نمودارهای متعارف مشخص می شوند و نمایش هر مجموعۀ ضریبهای رگرسیونی، بافه یا دسته ای از خطوط پدید می آورد.
broader: تحلیل رگرسیون
preferred label: bunch-map analysis @en
type: Concept