مشتق‌گیری ضمنی
scope note: وقتی معادله ای بر حسب دو متغیر در دست است، فرآیند یافتن مشتق یکی از دو متغیر نسبت به متغیر دیگر به این نحو که نخست از همه جمله های معادله مشتق می گیرند و سپس مشتق مورد نظر را با حل معادله حاصل نسبت به آن به دست می آورند.
related: روش ذوزنقه‌ای صریح
broader: مشتق‌گیری
preferred label: implicit differentiation @en
type: Concept

مشتق‌گیری
preferred label: differentiation @en
type: Concept
narrower: مشتق‌گیری ضمنی

روش ذوزنقه‌ای صریح
preferred label: implicit trapezoidal method @en
type: Concept
related: مشتق‌گیری ضمنی