معادله دوجمله‌ای
scope note: معادله ای به شکل x به توان n برابر a می باشد.
broader: معادله کلاسیک
preferred label: binomial equation @en
type: Concept

معادله کلاسیک
preferred label: classic equation @en
type: Concept
narrower: معادله دوجمله‌ای