مدار (دینامیک)
preferred label: orbit (dynamics) @en
type: Concept
narrower: مدار هم‌کلینیک

مدار هم‌کلینیک
alternative label: مدار هم‌بالینی
scope note: اگر نقاط تعادل در شروع و پایان مدار یکی باشند آن مدار را هم‌بالینی گوییم.
broader: مدار (دینامیک)
preferred label: homoclinic orbit @en
type: Concept