روش صریح
preferred label: explicit method @en
type: Concept
related: روش مجموع یابی هولدر

روش مجموع یابی هولدر
scope note: روشی برای انتساب مجموع به بعضی از سری های واگرا که در آن سری جدیدی تشکیل می شود که هر یک از مجموع های جزیی آن برابر با متوسط n مجموع جزیی نخستین سری اولیه است و این فرایند تا رسیدن به مرحله ای که حد این متوسط موجود باشد، تکرار می شود.
related: روش صریح
broader: روش مجموع‌پذیری
preferred label: Holder summation method @en
type: Concept

روش مجموع‌پذیری
preferred label: summability method @en
type: Concept
narrower: روش مجموع یابی هولدر