رمزهای کلاسیک
preferred label: classical ciphers @en
type: Concept
narrower: رمز سزار

رمز سزار
scope note: رمز سزار یکی از ساده‌ترین و شناخته‌ترین تکنیکهای رمز نگاری است که با عناوین کد سزار یا جابجایی سزار شناخته می‌شود. این رمز یک نوع رمز جانشینی است که هر حرف در متن اصلی با حرف دیگری با فاصله ثابت جابجا می‌شود
broader: رمزهای کلاسیک
preferred label: Caesar cipher @en
type: Concept