طرح چند امضایی وکالتی
preferred label: proxy multi-signature scheme @en
type: Concept
narrower: طرح چند امضایی وکالتی عمومی

طرح چند امضایی وکالتی عمومی
scope note: در این نوع طرح حضور و موافقت همه ی امضا کنندگان اصلی برای واگذاری حق امضایشان به وکیل الزامی است.
broader: طرح چند امضایی وکالتی
preferred label: public proxy multi-signature scheme @en
type: Concept