حمله غیر فعال
scope note: مهاجم فقط کانال ارتباطی را تحت شنود قرار می دهد و محرمانگی مورد حمله قرار می گیرد.
related: مهاجم
broader: حملات رمزنگاری
preferred label: passive attack @en
type: Concept

مهاجم
preferred label: attacker @en
type: Concept

حملات رمزنگاری
preferred label: cryptographic attacks @en
type: Concept
narrower: حمله غیر فعال