رمزنگاری کوانتومی
scope note: تنها برای تولید و توزیع کلید استفاده می شود نه برای انتقال اطلاعات.
broader: سیستم رمزنگاری
preferred label: quantum cryptography @en
type: Concept

سیستم رمزنگاری
preferred label: cryptography system @en
type: Concept
narrower: رمزنگاری کوانتومی