کره سماوی
preferred label: celestial sphere @en
type: Concept
narrower: دایره‌البروج

دایره‌البروج
scope note: حرکت سالانه خورشید به دورزمین روی کره سماوی.
broader: کره سماوی
preferred label: ecliptic @en
type: Concept