ناحیه رد
preferred label: rejection region @en
type: Concept
narrower: ناحیه بحرانی

ناحیه بحرانی
scope note: مجموعه ای از مقادیر نمونه ای که به رد کردن فرض صفر می انجامد.
broader: ناحیه رد
preferred label: criterion region @en
type: Concept