نمودار میله‌ای
scope note: نموداری از داده ها ی جدول فراوانی که در آن در هر مقدار از متغیری تصادفی که فقط مقادیر گسسته مشخصی اختیار می کند، مستطیلی ساخته می شود که ارتفاعش متناسب با فراوانی آن مقدار است.
broader: نمودار آماری
preferred label: bar graph @en
type: Concept

نمودار آماری
preferred label: statistical graph @en
type: Concept
narrower: نمودار میله‌ای