مسئله مقدار مرزی دیریکله
alternative label: مسئله مقدار کرانه‌ای دیریکله
scope note: یک معادله دیفرانسیل جزیی با مقدار دیریکله داده شده روی کران یک مسئله مقدار مرزی دیریکله است.
related: شرط مرزی دیریکله
broader: مسئله مقدار مرزی معادله دیفرانسیل جزئی
preferred label: Dirichlet boundary value problem @en
type: Concept

مسئله مقدار مرزی معادله دیفرانسیل جزئی
preferred label: boundary value problem for partial differential equation @en
type: Concept
narrower: مسئله مقدار مرزی دیریکله

شرط مرزی دیریکله
preferred label: Dirichlet boundary condition @en
type: Concept
related: مسئله مقدار مرزی دیریکله