معادله دوهمساز
preferred label: biharmonic equation @en
type: Concept
narrower: تابع دوهمساز

تابع دوهمساز
alternative label: تابع همسازدوگانه
scope note: جوابی از معادله دیفرانسیل جزیی لاپلاس همگن که در مسائل الکترواستاتیک به دفعات بکار می‌رود.
broader: معادله دوهمساز
preferred label: biharmonic function @en
type: Concept