مسئله کوشی
preferred label: Cauchy problem @en
type: Concept
narrower: قضیه کوشی-کوالفسکایا

قضیه کوشی-کوالفسکایا
scope note: این قضیه وجود و یکتایی جواب های مسألهی کوشی را بیان می کند.
broader: مسئله کوشی
preferred label: Cauchy-Kovalovskaya theorem @en
type: Concept