نوسانگر جفت‌شده
scope note: نوسانگرها را جفت‌شده گویند هرگاه بتوانند اثر متقابلی با یک دیگر داشته باشند. و زمانی که آنها جفت شوند دیگر مانند یک نوسانگر رفتار نکنند یعنی رفتار چرخه‌ای نداشته باشند.
broader: نوسانگر
preferred label: coupled oscillator @en
type: Concept

نوسانگر
preferred label: oscillator @en
type: Concept
narrower: نوسانگر جفت‌شده