قوانین دمورگان
scope note: متمم اجتماع دو مجموعه برابر است با اشتراک متمم های آنها و متمم اشتراک دو مجموعه برابر است با اجتماع متمم های آنها.
related: مجموعه متمم
broader: قاعده
preferred label: de Morgan 's rules @en
type: Concept

قاعده
preferred label: rule @en
type: Concept
narrower: قوانین دمورگان

مجموعه متمم
preferred label: complement set @en
type: Concept
related: قوانین دمورگان