سور عمومی
scope note: رابطه ای منطقی که میتوان آن را با عبارت به ازای همه یا به ازای هر بیان کرد .
related: زبان مرتبه اول
broader: سور
preferred label: universal quantifier @en
type: Concept

سور
preferred label: quantifier @en
type: Concept
narrower: سور عمومی

زبان مرتبه اول
preferred label: first order language @en
type: Concept
related: سور عمومی