مجموعه
preferred label: set @en
type: Concept
narrower: نمودار ون

نمودار ون
scope note: مدل هایی شهودی در نظریه مجموعه ها که برای نمایش روابط منطقی و ریاضی بین دو مجموعه به کار می روند.
broader: مجموعه
preferred label: Venn diagram @en
type: Concept