فضای توپولوژیک
preferred label: topological space @en
type: Concept
related: نقطه چگالش

نظریه توصیفی مجموعه‌ها
preferred label: descriptive set theory @en
type: Concept
narrower: نقطه چگالش

نقطه چگالش
scope note: در یک مجموعه، نقطه‌ای که همه همسایگی‌هایش شامل تعداد ناشمارایی از نقاط آن مجموعه باشند.
related: فضای توپولوژیک
broader: نظریه توصیفی مجموعه‌ها
preferred label: condensation point @en
type: Concept