پیشامد
preferred label: event @en
type: Concept
narrower: پیشامدهای دوبدو ناسازگار

پیشامدهای دوبدو ناسازگار
scope note: دو یا چند پیشامد که رخ دادن هر یک از آنها وقوع هر یک از پیشامدهای دیگر را غیر ممکن می سازد.
broader: پیشامد
preferred label: mutually exclusive events @en
type: Concept