حدس گولدباخ
scope note: هر عدد زوج بزرگتر از چهار، مجموع دو عدد اول فرد است.
broader: نظریه جمعی اعداد
preferred label: Goldbach conjecture @en
type: Concept

نظریه جمعی اعداد
preferred label: additive number theory @en
type: Concept
narrower: حدس گولدباخ