توزیع پایدار
preferred label: stable distribution @en
type: Concept
narrower: ضریب بتا

ضریب بتا
scope note: نسبتی بین گشتاورها، بخصوص آنکه برای توصیف چاولگی و کشیدگی به کار می رود.
broader: توزیع پایدار
preferred label: beta coefficient @en
type: Concept