عدد صحیح خاص
preferred label: special integer @en
type: Concept
narrower: عدد تام

عدد تام
scope note: عدد صحیحی که برابر با مجموع همه عوامل اول خود بجز خودش است.
broader: عدد صحیح خاص
preferred label: perfect number @en
type: Concept