عدد اول مرسن
preferred label: Mersenne prime @en
type: Concept
related: عدد مرسن

عدد صحیح خاص
preferred label: special integer @en
type: Concept
narrower: عدد مرسن

عدد مرسن
scope note: عددی به شکل 2 بتوان p منهای یک، که در آن p عددی اول است.
related: عدد اول مرسن
broader: عدد صحیح خاص
preferred label: Mersenne number @en
type: Concept