اعداد هرمی
scope note: عددهای 1و4و10و20و35و... که تعداد نقطه ها در آرایه هرمی متوالی هستند.
broader: اعداد مصور
preferred label: pyramidal numbers @en
type: Concept

اعداد مصور
preferred label: figurate numbers @en
type: Concept
narrower: اعداد هرمی