همساز کروی
preferred label: spherical harmonic @en
type: Concept
related: همساز مشبک

همساز مشبک
alternative label: هارمونیک مشبک
scope note: همسازی کروی که هم روی مجموعه ای از نصف النهار های متساوی الفاصله و هم روی مجموعه ای از خطوط عرض جغرافیایی برابر صفر است و کره را به نواحی مستطیلی و مثلثی تقسیم می کند.
related: همساز کروی
broader: تابع همساز
preferred label: tesseral harmonics @en
type: Concept

تابع همساز
preferred label: harmonic function @en
type: Concept
narrower: همساز مشبک