آنالیز تابعی غیر کلاسیک
preferred label: non-classical functional analysis @en
type: Concept
narrower: آنالیز تابعی ساختی

آنالیز تابعی ساختی
alternative label: آنالیز تابعی تاسیسی
scope note: در مقابل آنالیز کلاسیک است که همان قضایای آنالیز کلاسیک را به فضاهای تفکیک پذیر تعمیم می‌دهد و در برخی موارد تقریب می‌زند.
related: فضای جدایی‌پذیر
broader: آنالیز تابعی غیر کلاسیک
preferred label: constructive functional analysis @en
type: Concept

فضای جدایی‌پذیر
preferred label: separable space @en
type: Concept
related: آنالیز تابعی ساختی