قطعه کروی
scope note: جسمی محدود به یک کره و دو صفحه موازی که کره را قطع می کنند یا بر آن مماس اند.
related: صفحه مماس
broader: کره
preferred label: spherical segment @en
type: Concept

کره
preferred label: sphere @en
type: Concept
narrower: قطعه کروی

صفحه مماس
preferred label: tangent Plane @en
type: Concept
related: قطعه کروی