مخروط مستدیر
preferred label: circular cone @en
type: Concept
narrower: مخروط مستدیر قائم

مخروط مستدیر قائم
scope note: مخروط مستدیری که محورش عمود بر قاعده آن است .
broader: مخروط مستدیر
preferred label: right circular cone @en
type: Concept