رویه
preferred label: surface @en
type: Concept
narrower: رویه خط دار

رویه جبری
preferred label: algebraic surface @en
type: Concept
related: رویه خط دار

رویه خط دار
alternative label: سطح خط دار
scope note: رویه ای که می توان آن را با حرکت خط راستی تولید کرد.
related: رویه جبری
broader: رویه
preferred label: ruled surface @en
type: Concept