صفحه ناتباهیده
scope note: صفحه ای که در آن به ازای هر خط L دست کم دو نقطه متمایز وجود دارند که روی L واقع نیستند، وبه ازای هر نقطه p دست کم دو خط متمایز وجود دارند که از p نمی گذرند.
broader: هندسه تصویری
preferred label: non-degenerate plane @en
type: Concept

هندسه تصویری
preferred label: projective geometry @en
type: Concept
narrower: صفحه ناتباهیده