نقطه آرمانی
alternative label: نقطه در بینهایت
scope note: همه خطهای موازی با یک خط مفروض یکدیگر را در نقطه ای در بینهایت قطع می کنند.
broader: هندسه تصویری
preferred label: ideal point @en
type: Concept

هندسه تصویری
preferred label: projective geometry @en
type: Concept
narrower: نقطه آرمانی