مختصات بیضوی
scope note: مختصات نقطه ای در صفحه که بوسیله بیضی ها و هذلولی های هم کانون معین می شوند.
related: بیضی‌وار
broader: هندسه مختصاتی
preferred label: elliptic coordinates @en
type: Concept

بیضی‌وار
preferred label: ellipsoid @en
type: Concept
related: مختصات بیضوی

هندسه مختصاتی
preferred label: coordinate geometry @en
type: Concept
narrower: مختصات بیضوی