خمیدگی
preferred label: curvature @en
type: Concept
narrower: دایره خمیدگی

دایره خمیدگی
alternative label: دایره انحنا
scope note: دایره مماس بر یک خم در طرف مقعر آن، که در نقطه تماس دارای همان خمیدگی است که خم دارد.
related: فرمول فرنه-سِر
broader: خمیدگی
preferred label: circle of curvature @en
type: Concept

فرمول فرنه-سِر
preferred label: Frenet-Serre formula @en
type: Concept
related: دایره خمیدگی